maritime pollutant type code
type: ObjectProperty
comment: added from BSP (per-class property assessment)
definition: A code specifying a type of maritime pollutant for the transported dangerous goods.
domain includes: DangerousGoods
range includes: any-code
term status: proposed