marine pollutant indicator
type: DatatypeProperty
comment: added from BSP (per-class property assessment)
definition: The indication of whether or not these transported dangerous goods have a marine pollutant content.
domain includes: DangerousGoods
range includes: string
term status: proposed