m srpprice
type: ObjectProperty
comment: added from BSP (default-keep re-triage)
domain includes: Product
range includes: TradePrice
definition: The MSRP (Manufacturer Suggested Retail Price) for this trade product.
term status: proposed