logistics shipping marks marking instruction code
type: ObjectProperty
comment: added from BSP (default-keep re-triage)
definition: A code specifying a marking instruction for these logistics shipping marks.
domain includes: ShippingMarks
range includes: marking-instruction-code-list
term status: proposed