loaded dangerous goods
type: ObjectProperty
comment: added from BSP (default-keep re-triage)
definition: Dangerous goods loaded into or onto this piece of associated transport equipment.
domain includes: TransportEquipment
range includes: DangerousGoods
term status: proposed