line total amount
type: ObjectProperty
comment: brought back from BSP; attached to existing class (BSP home dissolved/niche)
domain includes: TradeSettlement
range includes: MonetaryAmount
definition: A monetary value of the line amount total being reported in this trade settlement header monetary summation.
term status: proposed