latest received geographical coordinate
type: ObjectProperty
comment: added from BSP (per-class property assessment)
domain includes: IOTDevice
range includes: Coordinate
definition: The latest geographical coordinates received by this monitoring IOT device, from the perspective of the receiver.
term status: proposed