industry category
type: ObjectProperty
comment: Open code list — typically ISIC or NACE, bound downstream.
definition: The industry sector classification of an organisation.
domain includes: Organisation
range includes: isic
term status: proposed