included within consignment item
type: ObjectProperty
comment: restored from BSP (default-keep re-triage)
definition: The consignment item within which this supply chain trade line item is included.
domain includes: ConsignmentItem
range includes: ConsignmentItem
term status: proposed