included supply chain trade line item
type: ObjectProperty
comment: restored from BSP (default-keep re-triage)
domain includes: ConsignmentItem
range includes: ConsignmentItem
definition: A supply chain trade line item included in this logistics package.
term status: proposed