i mdgsegregation group code
type: ObjectProperty
comment: added from BSP (per-class property assessment)
domain includes: DangerousGoods
range includes: any-code
definition: The code specifying the IMDG (International Maritime Dangerous Goods regulation) segregation group for these transported dangerous goods.
term status: proposed