hazard type code
type: ObjectProperty
comment: added from BSP (per-class property assessment)
domain includes: DangerousGoods
range includes: any-code
definition: A code specifying the type of hazard for these transported dangerous goods.
term status: proposed