handling instructions
type: DatatypeProperty
comment: brought back from BSP; attached to existing class (BSP home dissolved/niche)
definition: Handling instructions for the transported dangerous goods.
domain includes: Consignment
domain includes: DangerousGoods
range includes: string
term status: proposed