payment guarantee means guarantee method code
type: ObjectProperty
comment: added from BSP (default-keep re-triage)
definition: The code specifying the method of guarantee for this trade settlement payment means.
domain includes: PaymentMeans
range includes: payment-guarantee-means-code-list
term status: proposed