gross weight
type: ObjectProperty
domain includes: DeclarationDetails
domain includes: Consignment
domain includes: ConsignmentItem
domain includes: TransportPackage
domain includes: CargoDetails
domain includes: TransportEquipment
range includes: Measure
definition: The gross weight (mass) of the cargo unit, as a measure.
term status: proposed