government action code
type: ObjectProperty
comment: code → government-action scheme (re-added from BSP).
definition: An action for a responsible agency in this cross-border regulatory procedure.
domain includes: RegulatoryProcedure
range includes: government-action-code-list
term status: proposed