frequency type code
type: ObjectProperty
comment: added from BSP (per-class property assessment)
definition: The code specifying the type of frequency for this transport route, such as weekly, bi-monthly or daily.
domain includes: TransportRoute
range includes: any-code
term status: proposed