freight charge tariff class code
type: ObjectProperty
comment: added from BSP (default-keep re-triage)
definition: The code specifying the tariff class for this logistics service charge which represents an entry in a table of fixed charges [Reference United Nations Code List (UNCL) 5243].
domain includes: ServiceCharge
range includes: freight-charge-tariff-class-code-list
term status: proposed