flag country
type: ObjectProperty
comment: code → ISO 3166-1 scheme.
definition: The flag state of a vessel, as an ISO 3166-1 code.
domain includes: Vessel
range includes: country-id
term status: proposed