export country
type: ObjectProperty
comment: brought back from BSP; attached to existing class (BSP home dissolved/niche)
definition: The export country for this supply chain consignment item.
domain includes: Consignment
domain includes: ConsignmentItem
range includes: country-id
term status: proposed