expiry date time
type: DatatypeProperty
comment: added from BSP (per-class property assessment)
domain includes: TradePrice
range includes: dateTime
definition: An expiry date, time, date time or other date time value for this specified licence.
term status: proposed