payment terms event time reference from event code
type: ObjectProperty
comment: added from BSP (per-class property assessment)
definition: The code specifying the event from which these trade payment terms are offered for a length of time.
domain includes: PaymentTerms
range includes: any-code
term status: proposed