endorsement level
type: ObjectProperty
comment: code → scheme-endorsement-level scheme.
definition: The level of endorsement the scheme has received.
domain includes: Scheme
range includes: scheme-endorsement-level
term status: proposed