email uriid
type: DatatypeProperty
comment: added from BSP (per-class property assessment)
domain includes: Communication
range includes: anyURI
definition: The Uniform Resource Identifier (URI) of the email for this universal communication.
term status: proposed