duty regime type code
type: ObjectProperty
comment: code → customs-duty-regime scheme (re-added from BSP).
domain includes: TradeTax
range includes: customs-duty-regime-type-code-list
definition: The type of regime applicable to the assessment or calculation of this tax, levy or duty.
term status: proposed