drawee
type: ObjectProperty
provenance: Proposed Vocab addition — not from BSP/UNTP; pending governance approval.
domain includes: TradeSettlement
range includes: Party
definition: The party on whom a bill of exchange is drawn (who must pay).
term status: proposed