dangerous goods regulation code
type: ObjectProperty
comment: added from BSP (default-keep re-triage)
domain includes: DangerousGoods
range includes: dangerous-goods-regulation-code-list
definition: The code specifying a regulation applicable to these transported dangerous goods.
term status: proposed