customs duty indicator
type: DatatypeProperty
comment: added from BSP (per-class property assessment)
domain includes: TradeTax
range includes: string
definition: The indication of whether or not this registered tax is a customs duty.
term status: proposed