country sub division id
type: ObjectProperty
comment: added from BSP (per-class property assessment)
domain includes: GovernmentRegistration
range includes: iso-3166-2
definition: A unique identifier of the country sub-division for this legal registration.
term status: proposed