country of origin
type: ObjectProperty
comment: code → ISO 3166-1 scheme.
definition: The country of origin of a declared goods item, as an ISO 3166-1 code.
domain includes: DeclarationDetails
range includes: country-id
term status: proposed