control result
type: DatatypeProperty
comment: restored from BSP (default-keep re-triage)
definition: A control result, expressed as text, for this cross-border regulatory procedure.
domain includes: RegulatoryProcedure
range includes: string
term status: proposed