contained consignment
type: ObjectProperty
comment: restored from BSP (default-keep re-triage)
domain includes: TransportEquipment
range includes: Consignment
definition: A consignment contained in this piece of logistics transport equipment.
term status: proposed