Workplace Safety
type: Concept
broader: human-equity-and-welfare
definition: Protecting worker health and safety through hazard prevention, protective equipment, and safe working environments.
in scheme: conformity-topics
notation: 02.03
related match: http://metadata.un.org/sdg/3
scope note: EU ESPR Art. 10 - Social Impact; UNTP social.safety.