Voluntary Standards
type: Concept
broader: technical-conformity
definition: Adherence to consensus-based standards developed by recognized standards bodies for products, services, and management systems.
in scheme: conformity-topics
notation: 10.02
related match: http://metadata.un.org/sdg/9
scope note: WTO TBT Agreement Art. 4 - Standards; ISO, IEC, ITU standards.