Sustainable Investment
type: Concept
broader: economic-sustainability
definition: Directing capital toward green initiatives, sustainable technologies, and projects with positive environmental and social outcomes.
in scheme: conformity-topics
notation: 06.02
related match: http://metadata.un.org/sdg/9
scope note: EU ESPR Art. 5 - Resource Efficiency.