Supply Chain Labor Rights
type: Concept
broader: circular-value-chains
definition: Ensuring fair treatment of workers throughout the supply chain including subcontractors and informal workers.
in scheme: conformity-topics
notation: 05.05
related match: http://metadata.un.org/sdg/8
scope note: EU ESPR Annex I - Labor Standards.