Rules of Origin
type: Concept
broader: trade-and-market-access
definition: Verification of product origin to determine eligibility for preferential tariff treatment under trade agreements.
in scheme: conformity-topics
notation: 09.03
related match: http://metadata.un.org/sdg/17
scope note: WTO Agreement on Rules of Origin; WCO Revised Kyoto Convention.