Healthcare Access
type: Concept
broader: health-and-safety
definition: Providing access to medical support, occupational health services, and health insurance for workers.
in scheme: conformity-topics
notation: 07.05
related match: http://metadata.un.org/sdg/3
scope note: EU ESPR Art. 10 - Health Provisions.