Gender Equity
type: Concept
broader: human-equity-and-welfare
definition: Promoting gender diversity, equal opportunity, and elimination of gender-based discrimination in employment and business practices.
in scheme: conformity-topics
notation: 02.08
related match: http://metadata.un.org/sdg/5
scope note: EU ESPR Art. 10 - Social Sustainability.