Customs Classification
type: Concept
broader: trade-and-market-access
definition: Accurate tariff classification and customs valuation of goods in accordance with the Harmonized System and national schedules.
in scheme: conformity-topics
notation: 09.02
related match: http://metadata.un.org/sdg/17
scope note: WCO Harmonized System Convention.