Community Empowerment
type: Concept
broader: human-equity-and-welfare
definition: Supporting local community development, livelihoods, and participation in decisions that affect their wellbeing.
in scheme: conformity-topics
notation: 02.04
related match: http://metadata.un.org/sdg/1
scope note: EU ESPR Art. 10 - Stakeholder Engagement; UNTP social.community.