component batch
type: ObjectProperty
comment: added from BSP (per-class property assessment)
definition: A product batch component of this product batch.
domain includes: ProductBatch
range includes: ProductBatch
term status: proposed