completion date
type: DatatypeProperty
comment: added from BSP (default-keep re-triage)
definition: The completion date of this production facility.
domain includes: Facility
range includes: date
term status: proposed