common name
type: DatatypeProperty
comment: restored from BSP (default-keep re-triage)
definition: A common name, expressed as text, for this distinct chemical.
domain includes: Product
range includes: string
term status: proposed