commodity code
type: ObjectProperty
comment: code → HS / commodity scheme (Phase 3). Shared cargo/goods property.
domain includes: DeclarationDetails
domain includes: CargoDetails
domain includes: ConsignmentItem
range includes: hs-commodity
definition: The tariff/HS commodity classification of a goods item.
term status: proposed