supply chain supply plan commitment level code
type: ObjectProperty
comment: added from BSP (default-keep re-triage)
domain includes: SupplyPlan
range includes: commitment-level-code-list
definition: The code specifying the commitment level for this supply chain supply plan, such as fabrication or raw material.
term status: proposed