city sub division name
type: DatatypeProperty
comment: restored from BSP (default-keep re-triage)
domain includes: Address
range includes: string
definition: A name, expressed as text, of a sub-division of a city for this trade address, for example a district or borough.
term status: proposed