charge paying party role code
type: ObjectProperty
comment: added from BSP (default-keep re-triage)
definition: The code specifying the role of the party responsible for paying this logistics service charge.
domain includes: ServiceCharge
range includes: charge-paying-party-role-code-list
term status: proposed