carried inactive transport means
type: ObjectProperty
comment: restored from BSP (default-keep re-triage)
definition: Details of transport means inactively carried during the transport movement, such as trucks on a Roll-On/Roll-Off (RORO) ferry.
domain includes: TransportMovement
range includes: TransportMeans
term status: proposed