cancellation percent
type: DatatypeProperty
comment: added from BSP (per-class property assessment)
domain includes: TradePrice
range includes: decimal
definition: The cancellation percentage for this trade price.
term status: proposed